"C:\Program Files\Java\jdk-22\bin\java.exe" "-Dmaven.multiModuleProjectDirectory=C:\Users\Ale\Documents\java projects\maven-plugin-test2" -Djansi.passthrough=true "-Dmaven.home=C:\Program Files\JetBrains\IntelliJ IDEA 2024.2.3\plugins\maven\lib\maven3" "-Dclassworlds.conf=C:\Program Files\JetBrains\IntelliJ IDEA 2024.2.3\plugins\maven\lib\maven3\bin\m2.conf" "-Dmaven.ext.class.path=C:\Program Files\JetBrains\IntelliJ IDEA 2024.2.3\plugins\maven\lib\maven-event-listener.jar" "-javaagent:C:\Program Files\JetBrains\IntelliJ IDEA 2024.2.3\lib\idea_rt.jar=50858" -Dfile.encoding=UTF-8 -Dsun.stdout.encoding=UTF-8 -Dsun.stderr.encoding=UTF-8 -classpath "C:\Program Files\JetBrains\IntelliJ IDEA 2024.2.3\plugins\maven\lib\maven3\boot\plexus-classworlds-2.8.0.jar;C:\Program Files\JetBrains\IntelliJ IDEA 2024.2.3\plugins\maven\lib\maven3\boot\plexus-classworlds.license" org.codehaus.classworlds.Launcher -Didea.version=2024.3.5 verify -X
Apache Maven 3.9.9 (8e8579a9e76f7d015ee5ec7bfcdc97d260186937)
Maven home: C:\Program Files\JetBrains\IntelliJ IDEA 2024.2.3\plugins\maven\lib\maven3
Java version: 22, vendor: Oracle Corporation, runtime: C:\Program Files\Java\jdk-22
Default locale: it_IT, platform encoding: UTF-8
OS name: "windows 11", version: "10.0", arch: "amd64", family: "windows"
[DEBUG] Included C:\Program Files\JetBrains\IntelliJ IDEA 2024.2.3\plugins\maven\lib\maven-event-listener.jar
[DEBUG] Populating class realm maven.ext
[DEBUG] Included C:\Program Files\JetBrains\IntelliJ IDEA 2024.2.3\plugins\maven\lib\maven-event-listener.jar
[DEBUG] Created new class realm maven.api
[DEBUG] Importing foreign packages into class realm maven.api
[DEBUG] Imported: javax.annotation.* < maven.ext
[DEBUG] Imported: javax.annotation.security.* < maven.ext
[DEBUG] Imported: javax.inject.* < maven.ext
[DEBUG] Imported: org.apache.maven.* < maven.ext
[DEBUG] Imported: org.apache.maven.artifact < maven.ext
[DEBUG] Imported: org.apache.maven.classrealm < maven.ext
[DEBUG] Imported: org.apache.maven.cli < maven.ext
[DEBUG] Imported: org.apache.maven.configuration < maven.ext
[DEBUG] Imported: org.apache.maven.exception < maven.ext
[DEBUG] Imported: org.apache.maven.execution < maven.ext
[DEBUG] Imported: org.apache.maven.execution.scope < maven.ext
[DEBUG] Imported: org.apache.maven.graph < maven.ext
[DEBUG] Imported: org.apache.maven.lifecycle < maven.ext
[DEBUG] Imported: org.apache.maven.model < maven.ext
[DEBUG] Imported: org.apache.maven.monitor < maven.ext
[DEBUG] Imported: org.apache.maven.plugin < maven.ext
[DEBUG] Imported: org.apache.maven.profiles < maven.ext
[DEBUG] Imported: org.apache.maven.project < maven.ext
[DEBUG] Imported: org.apache.maven.reporting < maven.ext
[DEBUG] Imported: org.apache.maven.repository < maven.ext
[DEBUG] Imported: org.apache.maven.rtinfo < maven.ext
[DEBUG] Imported: org.apache.maven.settings < maven.ext
[DEBUG] Imported: org.apache.maven.toolchain < maven.ext
[DEBUG] Imported: org.apache.maven.usability < maven.ext
[DEBUG] Imported: org.apache.maven.wagon.* < maven.ext
[DEBUG] Imported: org.apache.maven.wagon.authentication < maven.ext
[DEBUG] Imported: org.apache.maven.wagon.authorization < maven.ext
[DEBUG] Imported: org.apache.maven.wagon.events < maven.ext
[DEBUG] Imported: org.apache.maven.wagon.observers < maven.ext
[DEBUG] Imported: org.apache.maven.wagon.proxy < maven.ext
[DEBUG] Imported: org.apache.maven.wagon.repository < maven.ext
[DEBUG] Imported: org.apache.maven.wagon.resource < maven.ext
[DEBUG] Imported: org.codehaus.classworlds < maven.ext
[DEBUG] Imported: org.codehaus.plexus.* < maven.ext
[DEBUG] Imported: org.codehaus.plexus.classworlds < maven.ext
[DEBUG] Imported: org.codehaus.plexus.component < maven.ext
[DEBUG] Imported: org.codehaus.plexus.configuration < maven.ext
[DEBUG] Imported: org.codehaus.plexus.container < maven.ext
[DEBUG] Imported: org.codehaus.plexus.context < maven.ext
[DEBUG] Imported: org.codehaus.plexus.lifecycle < maven.ext
[DEBUG] Imported: org.codehaus.plexus.logging < maven.ext
[DEBUG] Imported: org.codehaus.plexus.personality < maven.ext
[DEBUG] Imported: org.codehaus.plexus.util.xml.Xpp3Dom < maven.ext
[DEBUG] Imported: org.codehaus.plexus.util.xml.pull.XmlPullParser < maven.ext
[DEBUG] Imported: org.codehaus.plexus.util.xml.pull.XmlPullParserException < maven.ext
[DEBUG] Imported: org.codehaus.plexus.util.xml.pull.XmlSerializer < maven.ext
[DEBUG] Imported: org.eclipse.aether.* < maven.ext
[DEBUG] Imported: org.eclipse.aether.artifact < maven.ext
[DEBUG] Imported: org.eclipse.aether.collection < maven.ext
[DEBUG] Imported: org.eclipse.aether.deployment < maven.ext
[DEBUG] Imported: org.eclipse.aether.graph < maven.ext
[DEBUG] Imported: org.eclipse.aether.impl < maven.ext
[DEBUG] Imported: org.eclipse.aether.installation < maven.ext
[DEBUG] Imported: org.eclipse.aether.internal.impl < maven.ext
[DEBUG] Imported: org.eclipse.aether.metadata < maven.ext
[DEBUG] Imported: org.eclipse.aether.repository < maven.ext
[DEBUG] Imported: org.eclipse.aether.resolution < maven.ext
[DEBUG] Imported: org.eclipse.aether.spi < maven.ext
[DEBUG] Imported: org.eclipse.aether.transfer < maven.ext
[DEBUG] Imported: org.eclipse.aether.util < maven.ext
[DEBUG] Imported: org.eclipse.aether.version < maven.ext
[DEBUG] Imported: org.fusesource.jansi.* < maven.ext
[DEBUG] Imported: org.slf4j.* < maven.ext
[DEBUG] Imported: org.slf4j.event.* < maven.ext
[DEBUG] Imported: org.slf4j.helpers.* < maven.ext
[DEBUG] Imported: org.slf4j.spi.* < maven.ext
[DEBUG] Populating class realm maven.api
[DEBUG] Created adapter factory; available factories [file-lock, rwlock-local, semaphore-local, noop]; available name mappers [discriminating, file-gav, file-hgav, file-static, gav, static]
[INFO] Error stacktraces are turned on.
[DEBUG] Message scheme: color
[DEBUG] Message styles: debug info warning error success failure strong mojo project
[DEBUG] Reading global settings from C:\Program Files\JetBrains\IntelliJ IDEA 2024.2.3\plugins\maven\lib\maven3\conf\settings.xml
[DEBUG] Reading user settings from C:\Users\Ale\.m2\settings.xml
[DEBUG] Reading global toolchains from C:\Program Files\JetBrains\IntelliJ IDEA 2024.2.3\plugins\maven\lib\maven3\conf\toolchains.xml
[DEBUG] Reading user toolchains from C:\Users\Ale\.m2\toolchains.xml
[DEBUG] Using local repository at C:\Users\Ale\.m2\repository
[DEBUG] Using manager EnhancedLocalRepositoryManager with priority 10.0 for C:\Users\Ale\.m2\repository
[INFO] Scanning for projects...
[DEBUG] Extension realms for project com.ale:maven-plugin-test:maven-plugin:1.0-SNAPSHOT: (none)
[DEBUG] Looking up lifecycle mappings for packaging maven-plugin from ClassRealm[maven.ext, parent: ClassRealm[plexus.core, parent: null]]
[DEBUG] === REACTOR BUILD PLAN ================================================
[DEBUG] Project: com.ale:maven-plugin-test:maven-plugin:1.0-SNAPSHOT
[DEBUG] Tasks: [verify]
[DEBUG] Style: Regular
[DEBUG] =======================================================================
[INFO]
[INFO] ---------------------< com.ale:maven-plugin-test >----------------------
[INFO] Building maven-plugin-test Maven Plugin 1.0-SNAPSHOT
[INFO] from pom.xml
[INFO] ----------------------------[ maven-plugin ]----------------------------
[DEBUG] Lifecycle clean -> [pre-clean, clean, post-clean]
[DEBUG] Lifecycle default -> [validate, initialize, generate-sources, process-sources, generate-resources, process-resources, compile, process-classes, generate-test-sources, process-test-sources, generate-test-resources, process-test-resources, test-compile, process-test-classes, test, prepare-package, package, pre-integration-test, integration-test, post-integration-test, verify, install, deploy]
[DEBUG] Lifecycle site -> [pre-site, site, post-site, site-deploy]
[DEBUG] Creating adapter using nameMapper 'gav' and factory 'rwlock-local'
[DEBUG] Lifecycle clean -> [pre-clean, clean, post-clean]
[DEBUG] Lifecycle default -> [validate, initialize, generate-sources, process-sources, generate-resources, process-resources, compile, process-classes, generate-test-sources, process-test-sources, generate-test-resources, process-test-resources, test-compile, process-test-classes, test, prepare-package, package, pre-integration-test, integration-test, post-integration-test, verify, install, deploy]
[DEBUG] Lifecycle site -> [pre-site, site, post-site, site-deploy]
[DEBUG] Lifecycle clean -> [pre-clean, clean, post-clean]
[DEBUG] Lifecycle default -> [validate, initialize, generate-sources, process-sources, generate-resources, process-resources, compile, process-classes, generate-test-sources, process-test-sources, generate-test-resources, process-test-resources, test-compile, process-test-classes, test, prepare-package, package, pre-integration-test, integration-test, post-integration-test, verify, install, deploy]
[DEBUG] Lifecycle site -> [pre-site, site, post-site, site-deploy]
[DEBUG] Lifecycle clean -> [pre-clean, clean, post-clean]
[DEBUG] Lifecycle default -> [validate, initialize, generate-sources, process-sources, generate-resources, process-resources, compile, process-classes, generate-test-sources, process-test-sources, generate-test-resources, process-test-resources, test-compile, process-test-classes, test, prepare-package, package, pre-integration-test, integration-test, post-integration-test, verify, install, deploy]
[DEBUG] Lifecycle site -> [pre-site, site, post-site, site-deploy]
[DEBUG] Lifecycle clean -> [pre-clean, clean, post-clean]
[DEBUG] Lifecycle default -> [validate, initialize, generate-sources, process-sources, generate-resources, process-resources, compile, process-classes, generate-test-sources, process-test-sources, generate-test-resources, process-test-resources, test-compile, process-test-classes, test, prepare-package, package, pre-integration-test, integration-test, post-integration-test, verify, install, deploy]
[DEBUG] Lifecycle site -> [pre-site, site, post-site, site-deploy]
[DEBUG] Lifecycle clean -> [pre-clean, clean, post-clean]
[DEBUG] Lifecycle default -> [validate, initialize, generate-sources, process-sources, generate-resources, process-resources, compile, process-classes, generate-test-sources, process-test-sources, generate-test-resources, process-test-resources, test-compile, process-test-classes, test, prepare-package, package, pre-integration-test, integration-test, post-integration-test, verify, install, deploy]
[DEBUG] Lifecycle site -> [pre-site, site, post-site, site-deploy]
[DEBUG] Lifecycle clean -> [pre-clean, clean, post-clean]
[DEBUG] Lifecycle default -> [validate, initialize, generate-sources, process-sources, generate-resources, process-resources, compile, process-classes, generate-test-sources, process-test-sources, generate-test-resources, process-test-resources, test-compile, process-test-classes, test, prepare-package, package, pre-integration-test, integration-test, post-integration-test, verify, install, deploy]
[DEBUG] Lifecycle site -> [pre-site, site, post-site, site-deploy]
[DEBUG] Lifecycle clean -> [pre-clean, clean, post-clean]
[DEBUG] Lifecycle default -> [validate, initialize, generate-sources, process-sources, generate-resources, process-resources, compile, process-classes, generate-test-sources, process-test-sources, generate-test-resources, process-test-resources, test-compile, process-test-classes, test, prepare-package, package, pre-integration-test, integration-test, post-integration-test, verify, install, deploy]
[DEBUG] Lifecycle site -> [pre-site, site, post-site, site-deploy]
[DEBUG] Lifecycle clean -> [pre-clean, clean, post-clean]
[DEBUG] Lifecycle default -> [validate, initialize, generate-sources, process-sources, generate-resources, process-resources, compile, process-classes, generate-test-sources, process-test-sources, generate-test-resources, process-test-resources, test-compile, process-test-classes, test, prepare-package, package, pre-integration-test, integration-test, post-integration-test, verify, install, deploy]
[DEBUG] Lifecycle site -> [pre-site, site, post-site, site-deploy]
[DEBUG] === PROJECT BUILD PLAN ================================================
[DEBUG] Project: com.ale:maven-plugin-test:1.0-SNAPSHOT
[DEBUG] Dependencies (collect): []
[DEBUG] Dependencies (resolve): [compile, compile+runtime, runtime, test]
[DEBUG] Repositories (dependencies): [central (https://repo.maven.apache.org/maven2, default, releases)]
[DEBUG] Repositories (plugins) : [central (https://repo.maven.apache.org/maven2, default, releases)]
[DEBUG] -----------------------------------------------------------------------
[DEBUG] Goal: org.apache.maven.plugins:maven-plugin-plugin:3.13.1:helpmojo (help-goal)
[DEBUG] Style: Regular
[DEBUG] Configuration:
${maven.plugin.skip}
[DEBUG] -----------------------------------------------------------------------
[DEBUG] Goal: org.apache.maven.plugins:maven-resources-plugin:3.3.1:resources (default-resources)
[DEBUG] Style: Regular
[DEBUG] Configuration:
${maven.resources.skip}
[DEBUG] -----------------------------------------------------------------------
[DEBUG] Goal: org.apache.maven.plugins:maven-compiler-plugin:3.13.0:compile (default-compile)
[DEBUG] Style: Regular
[DEBUG] Configuration:
${maven.compiler.compilerId}
${maven.compiler.compilerReuseStrategy}
${maven.compiler.compilerVersion}
${maven.compiler.createMissingPackageInfoClass}
${maven.compiler.debug}
${maven.compiler.debuglevel}
${maven.compiler.enablePreview}
${encoding}
${maven.compiler.executable}
${maven.compiler.failOnError}
${maven.compiler.failOnWarning}
${maven.compiler.forceJavacCompilerUse}
${maven.compiler.forceLegacyJavacApi}
${maven.compiler.fork}
${maven.compiler.implicit}
${maven.compiler.maxmem}
${maven.compiler.meminitial}
${maven.compiler.optimize}
${maven.compiler.outputDirectory}
${maven.compiler.parameters}
${maven.compiler.proc}
${maven.compiler.release}
${maven.compiler.showCompilationChanges}
${maven.compiler.showDeprecation}
${maven.compiler.showWarnings}
${maven.main.skip}
${maven.compiler.skipMultiThreadWarning}
${maven.compiler.source}
${lastModGranularityMs}
${maven.compiler.target}
${maven.compiler.useIncrementalCompilation}
${maven.compiler.verbose}
[DEBUG] -----------------------------------------------------------------------
[DEBUG] Goal: org.apache.maven.plugins:maven-plugin-plugin:3.13.1:descriptor (default-descriptor)
[DEBUG] Style: Regular
[DEBUG] Configuration:
${maven.plugin.checkExpectedProvidedScope}
${encoding}
${externalJavadocBaseUrls}
${internalJavadocBaseUrl}
${internalJavadocVersion}
${maven.plugin.skip}
true
[DEBUG] -----------------------------------------------------------------------
[DEBUG] Goal: org.apache.maven.plugins:maven-plugin-plugin:3.13.1:descriptor (mojo-descriptor)
[DEBUG] Style: Regular
[DEBUG] Configuration:
${maven.plugin.checkExpectedProvidedScope}
${encoding}
${externalJavadocBaseUrls}
${internalJavadocBaseUrl}
${internalJavadocVersion}
${maven.plugin.skip}
true
[DEBUG] -----------------------------------------------------------------------
[DEBUG] Goal: org.apache.maven.plugins:maven-resources-plugin:3.3.1:testResources (default-testResources)
[DEBUG] Style: Regular
[DEBUG] Configuration:
${maven.test.skip}
[DEBUG] -----------------------------------------------------------------------
[DEBUG] Goal: org.apache.maven.plugins:maven-compiler-plugin:3.13.0:testCompile (default-testCompile)
[DEBUG] Style: Regular
[DEBUG] Configuration:
${maven.compiler.compilerId}
${maven.compiler.compilerReuseStrategy}
${maven.compiler.compilerVersion}
${maven.compiler.createMissingPackageInfoClass}
${maven.compiler.debug}
${maven.compiler.debuglevel}
${maven.compiler.enablePreview}
${encoding}
${maven.compiler.executable}
${maven.compiler.failOnError}
${maven.compiler.failOnWarning}
${maven.compiler.forceJavacCompilerUse}
${maven.compiler.forceLegacyJavacApi}
${maven.compiler.fork}
${maven.compiler.implicit}
${maven.compiler.maxmem}
${maven.compiler.meminitial}
${maven.compiler.optimize}
${maven.compiler.parameters}
${maven.compiler.proc}
${maven.compiler.release}
${maven.compiler.showCompilationChanges}
${maven.compiler.showDeprecation}
${maven.compiler.showWarnings}
${maven.test.skip}
${maven.compiler.skipMultiThreadWarning}
${maven.compiler.source}
${lastModGranularityMs}
${maven.compiler.target}
${maven.compiler.testRelease}
${maven.compiler.testSource}
${maven.compiler.testTarget}
${maven.compiler.useIncrementalCompilation}
${maven.compiler.verbose}
[DEBUG] -----------------------------------------------------------------------
[DEBUG] Goal: org.apache.maven.plugins:maven-surefire-plugin:3.3.0:test (default-test)
[DEBUG] Style: Regular
[DEBUG] Configuration:
${maven.test.additionalClasspathDependencies}
${maven.test.additionalClasspath}
${argLine}
${childDelegation}
${maven.test.dependency.excludes}
${maven.surefire.debug}
${dependenciesToScan}
${disableXmlReport}
${enableAssertions}
${surefire.enableProcessChecker}
${surefire.encoding}
${surefire.excludeJUnit5Engines}
${surefire.excludedEnvironmentVariables}
${excludedGroups}
${surefire.excludes}
${surefire.excludesFile}
${surefire.failIfNoSpecifiedTests}
${failIfNoTests}
${surefire.failOnFlakeCount}
${forkCount}
${surefire.forkNode}
${surefire.exitTimeout}
${surefire.timeout}
${groups}
${surefire.includeJUnit5Engines}
${surefire.includes}
${surefire.includesFile}
${junitArtifactName}
${jvm}
${objectFactory}
${parallel}
${parallelOptimized}
${surefire.parallel.forcedTimeout}
${surefire.parallel.timeout}
${perCoreThreadCount}
${plugin.artifactMap}
${surefire.printSummary}
${project.artifactMap}
${maven.test.redirectTestOutputToFile}
${surefire.reportFormat}
${surefire.reportNameSuffix}
${surefire.rerunFailingTestsCount}
${reuseForks}
${surefire.runOrder}
${surefire.runOrder.random.seed}
${surefire.shutdown}
${maven.test.skip}
${surefire.skipAfterFailureCount}
${maven.test.skip.exec}
${skipTests}
${surefire.suiteXmlFiles}
${surefire.systemPropertiesFile}
${tempDir}
${test}
${maven.test.failure.ignore}
${testNGArtifactName}
${threadCount}
${threadCountClasses}
${threadCountMethods}
${threadCountSuites}
${trimStackTrace}
${surefire.useFile}
${surefire.useManifestOnlyJar}
${surefire.useModulePath}
${surefire.useSystemClassLoader}
${useUnlimitedThreads}
${basedir}
[DEBUG] -----------------------------------------------------------------------
[DEBUG] Goal: org.apache.maven.plugins:maven-jar-plugin:3.4.2:jar (default-jar)
[DEBUG] Style: Regular
[DEBUG] Configuration:
${maven.jar.detectMultiReleaseJar}
${maven.jar.forceCreation}
${jar.useDefaultManifestFile}
[DEBUG] -----------------------------------------------------------------------
[DEBUG] Goal: org.apache.maven.plugins:maven-plugin-plugin:3.13.1:addPluginArtifactMetadata (default-addPluginArtifactMetadata)
[DEBUG] Style: Regular
[DEBUG] Configuration:
${maven.plugin.skip}
[DEBUG] =======================================================================
[DEBUG] Using mirror maven-default-http-blocker (http://0.0.0.0/) for apache.snapshots (http://repository.apache.org/snapshots).
[DEBUG] Using mirror maven-default-http-blocker (http://0.0.0.0/) for repository.jboss.org (http://repository.jboss.org/maven2).
[DEBUG] Using mirror maven-default-http-blocker (http://0.0.0.0/) for snapshots.jboss.org (http://snapshots.jboss.org/maven2).
[DEBUG] Using mirror maven-default-http-blocker (http://0.0.0.0/) for oss.sonatype.org/jboss-snapshots (http://oss.sonatype.org/content/repositories/jboss-snapshots).
[DEBUG] Using mirror maven-default-http-blocker (http://0.0.0.0/) for codehaus.snapshots (http://snapshots.repository.codehaus.org).
[DEBUG] Using mirror maven-default-http-blocker (http://0.0.0.0/) for snapshots (http://snapshots.maven.codehaus.org/maven2).
[DEBUG] Using mirror maven-default-http-blocker (http://0.0.0.0/) for central (http://repo1.maven.org/maven2).
[DEBUG] Dependency collection stats {ConflictMarker.analyzeTime=1132000, ConflictMarker.markTime=189700, ConflictMarker.nodeCount=103, ConflictIdSorter.graphTime=835200, ConflictIdSorter.topsortTime=505900, ConflictIdSorter.conflictIdCount=40, ConflictIdSorter.conflictIdCycleCount=0, ConflictResolver.totalTime=6446800, ConflictResolver.conflictItemCount=100, DfDependencyCollector.collectTime=459225700, DfDependencyCollector.transformTime=10849900}
[DEBUG] com.ale:maven-plugin-test:maven-plugin:1.0-SNAPSHOT
[DEBUG] org.apache.maven:maven-plugin-api:jar:3.3.9:provided
[DEBUG] org.apache.maven:maven-model:jar:3.3.9:provided
[DEBUG] org.eclipse.sisu:org.eclipse.sisu.plexus:jar:0.3.2:provided
[DEBUG] javax.enterprise:cdi-api:jar:1.0:provided
[DEBUG] javax.annotation:jsr250-api:jar:1.0:provided
[DEBUG] org.eclipse.sisu:org.eclipse.sisu.inject:jar:0.3.2:provided
[DEBUG] org.apache.maven:maven-core:jar:3.3.9:provided
[DEBUG] org.apache.maven:maven-settings:jar:3.3.9:provided
[DEBUG] org.apache.maven:maven-settings-builder:jar:3.3.9:provided
[DEBUG] org.apache.maven:maven-builder-support:jar:3.3.9:provided
[DEBUG] org.apache.maven:maven-repository-metadata:jar:3.3.9:provided
[DEBUG] org.apache.maven:maven-model-builder:jar:3.3.9:provided
[DEBUG] com.google.guava:guava:jar:18.0:provided
[DEBUG] org.apache.maven:maven-aether-provider:jar:3.3.9:provided
[DEBUG] org.eclipse.aether:aether-spi:jar:1.0.2.v20150114:provided
[DEBUG] org.eclipse.aether:aether-impl:jar:1.0.2.v20150114:provided
[DEBUG] org.eclipse.aether:aether-api:jar:1.0.2.v20150114:provided
[DEBUG] org.eclipse.aether:aether-util:jar:1.0.2.v20150114:provided
[DEBUG] com.google.inject:guice:jar:no_aop:4.0:provided
[DEBUG] javax.inject:javax.inject:jar:1:provided
[DEBUG] aopalliance:aopalliance:jar:1.0:provided
[DEBUG] org.codehaus.plexus:plexus-interpolation:jar:1.21:provided
[DEBUG] org.codehaus.plexus:plexus-utils:jar:3.0.22:provided
[DEBUG] org.codehaus.plexus:plexus-classworlds:jar:2.5.2:provided
[DEBUG] org.codehaus.plexus:plexus-component-annotations:jar:1.6:provided
[DEBUG] org.sonatype.plexus:plexus-sec-dispatcher:jar:1.3:provided
[DEBUG] org.sonatype.plexus:plexus-cipher:jar:1.4:provided
[DEBUG] org.apache.commons:commons-lang3:jar:3.4:provided
[DEBUG] org.apache.maven:maven-artifact:jar:3.3.9:provided
[DEBUG] org.apache.maven:maven-compat:jar:3.3.9:test
[DEBUG] org.apache.maven.wagon:wagon-provider-api:jar:2.10:test
[DEBUG] org.apache.maven.plugin-tools:maven-plugin-annotations:jar:3.13.1:provided
[DEBUG] junit:junit:jar:4.12:test
[DEBUG] org.hamcrest:hamcrest-core:jar:1.3:test
[DEBUG] org.apache.maven.plugin-testing:maven-plugin-testing-harness:jar:3.3.0:test
[DEBUG] commons-io:commons-io:jar:2.2:test
[DEBUG] org.codehaus.plexus:plexus-archiver:jar:2.2:test
[DEBUG] org.codehaus.plexus:plexus-container-default:jar:1.0-alpha-9-stable-1:test
[DEBUG] classworlds:classworlds:jar:1.1-alpha-2:test
[DEBUG] org.codehaus.plexus:plexus-io:jar:2.0.4:test
[INFO]
[INFO] --- plugin:3.13.1:helpmojo (help-goal) @ maven-plugin-test ---
[DEBUG] Using mirror maven-default-http-blocker (http://0.0.0.0/) for jboss-public-repository-group (http://repository.jboss.org/nexus/content/groups/public).
[DEBUG] Using mirror maven-default-http-blocker (http://0.0.0.0/) for apache.snapshots (http://people.apache.org/repo/m2-snapshot-repository).
[DEBUG] Dependency collection stats {ConflictMarker.analyzeTime=665400, ConflictMarker.markTime=281600, ConflictMarker.nodeCount=196, ConflictIdSorter.graphTime=234400, ConflictIdSorter.topsortTime=58200, ConflictIdSorter.conflictIdCount=72, ConflictIdSorter.conflictIdCycleCount=0, ConflictResolver.totalTime=2490700, ConflictResolver.conflictItemCount=187, DfDependencyCollector.collectTime=551889800, DfDependencyCollector.transformTime=3774200}
[DEBUG] org.apache.maven.plugins:maven-plugin-plugin:jar:3.13.1
[DEBUG] org.apache.maven.plugin-tools:maven-plugin-tools-api:jar:3.13.1:compile
[DEBUG] org.apache.maven:maven-core:jar:3.9.6:compile (version managed from default)
[DEBUG] org.apache.maven:maven-settings-builder:jar:3.9.6:compile
[DEBUG] org.codehaus.plexus:plexus-sec-dispatcher:jar:2.0:compile
[DEBUG] org.codehaus.plexus:plexus-cipher:jar:2.0:compile
[DEBUG] org.apache.maven:maven-builder-support:jar:3.9.6:compile
[DEBUG] org.apache.maven:maven-repository-metadata:jar:3.9.6:compile
[DEBUG] org.apache.maven:maven-model-builder:jar:3.9.6:compile (version managed from default)
[DEBUG] org.apache.maven:maven-resolver-provider:jar:3.9.6:compile
[DEBUG] org.apache.maven.resolver:maven-resolver-impl:jar:1.9.18:compile
[DEBUG] org.apache.maven.resolver:maven-resolver-named-locks:jar:1.9.18:compile
[DEBUG] org.apache.maven.resolver:maven-resolver-spi:jar:1.9.18:compile
[DEBUG] org.apache.maven.shared:maven-shared-utils:jar:3.3.4:compile
[DEBUG] org.eclipse.sisu:org.eclipse.sisu.inject:jar:0.9.0.M2:compile (version managed from default)
[DEBUG] com.google.inject:guice:jar:5.1.0:compile
[DEBUG] aopalliance:aopalliance:jar:1.0:compile
[DEBUG] com.google.guava:guava:jar:32.0.1-jre:compile
[DEBUG] com.google.guava:failureaccess:jar:1.0.1:compile
[DEBUG] javax.inject:javax.inject:jar:1:compile
[DEBUG] org.codehaus.plexus:plexus-interpolation:jar:1.26:compile
[DEBUG] org.codehaus.plexus:plexus-component-annotations:jar:2.1.0:compile
[DEBUG] org.apache.commons:commons-lang3:jar:3.12.0:compile
[DEBUG] org.apache.maven:maven-model:jar:3.9.6:compile (version managed from default)
[DEBUG] org.apache.maven:maven-plugin-api:jar:3.9.6:compile (version managed from default)
[DEBUG] org.apache.maven:maven-artifact:jar:3.9.6:compile (version managed from default)
[DEBUG] org.slf4j:slf4j-api:jar:1.7.36:compile (version managed from default)
[DEBUG] org.apache.maven.reporting:maven-reporting-api:jar:3.1.1:compile (version managed from default)
[DEBUG] org.apache.maven.doxia:doxia-sink-api:jar:1.11.1:compile
[DEBUG] org.apache.maven.doxia:doxia-logging-api:jar:1.11.1:compile
[DEBUG] org.apache.maven:maven-settings:jar:3.9.6:compile (version managed from default)
[DEBUG] org.apache.maven.resolver:maven-resolver-api:jar:1.9.18:compile
[DEBUG] org.codehaus.plexus:plexus-classworlds:jar:2.7.0:compile
[DEBUG] org.eclipse.sisu:org.eclipse.sisu.plexus:jar:0.9.0.M2:compile (version managed from default)
[DEBUG] javax.annotation:javax.annotation-api:jar:1.2:compile
[DEBUG] javax.enterprise:cdi-api:jar:1.2:compile
[DEBUG] org.codehaus.plexus:plexus-xml:jar:3.0.1:compile (version managed from default)
[DEBUG] org.apache.httpcomponents:httpclient:jar:4.5.14:compile
[DEBUG] commons-logging:commons-logging:jar:1.2:compile
[DEBUG] commons-codec:commons-codec:jar:1.11:compile
[DEBUG] org.apache.httpcomponents:httpcore:jar:4.4.16:compile
[DEBUG] org.apache.maven.wagon:wagon-provider-api:jar:3.5.3:compile
[DEBUG] org.codehaus.plexus:plexus-java:jar:1.2.0:compile
[DEBUG] org.apache.maven.plugin-tools:maven-plugin-tools-generators:jar:3.13.1:compile
[DEBUG] org.apache.velocity:velocity:jar:1.7:compile (version managed from default)
[DEBUG] commons-lang:commons-lang:jar:2.4:compile
[DEBUG] org.jsoup:jsoup:jar:1.17.2:compile (version managed from default)
[DEBUG] net.sf.jtidy:jtidy:jar:r938:compile
[DEBUG] org.apache.maven.plugin-tools:maven-plugin-tools-java:jar:3.13.1:runtime
[DEBUG] com.thoughtworks.qdox:qdox:jar:2.1.0:compile (version managed from default)
[DEBUG] org.apache.maven.plugin-tools:maven-plugin-tools-annotations:jar:3.13.1:runtime
[DEBUG] org.codehaus.plexus:plexus-archiver:jar:4.9.2:runtime (version managed from default)
[DEBUG] org.codehaus.plexus:plexus-io:jar:3.4.2:runtime
[DEBUG] commons-io:commons-io:jar:2.15.1:runtime
[DEBUG] org.apache.commons:commons-compress:jar:1.26.1:runtime
[DEBUG] org.iq80.snappy:snappy:jar:0.4:runtime
[DEBUG] org.tukaani:xz:jar:1.9:runtime
[DEBUG] com.github.luben:zstd-jni:jar:1.5.5-11:runtime
[DEBUG] org.ow2.asm:asm:jar:9.7:compile (version managed from default)
[DEBUG] org.ow2.asm:asm-util:jar:9.7:runtime (version managed from default)
[DEBUG] org.ow2.asm:asm-tree:jar:9.7:runtime
[DEBUG] org.ow2.asm:asm-analysis:jar:9.7:runtime
[DEBUG] org.apache.maven.plugin-tools:maven-plugin-annotations:jar:3.13.1:compile
[DEBUG] org.apache.maven.plugin-tools:maven-plugin-tools-ant:jar:3.13.1:runtime (optional)
[DEBUG] org.apache.maven.plugin-tools:maven-plugin-tools-model:jar:3.13.1:runtime (optional) (version managed from default)
[DEBUG] org.apache.maven.plugin-tools:maven-plugin-tools-beanshell:jar:3.13.1:runtime (optional)
[DEBUG] org.apache-extras.beanshell:bsh:jar:2.0b6:runtime (optional)
[DEBUG] org.apache.maven.resolver:maven-resolver-util:jar:1.9.18:compile
[DEBUG] org.codehaus.plexus:plexus-utils:jar:4.0.1:compile
[DEBUG] org.codehaus.plexus:plexus-velocity:jar:1.2:compile (exclusions managed from default)
[DEBUG] commons-collections:commons-collections:jar:3.1:compile
[DEBUG] org.sonatype.plexus:plexus-build-api:jar:0.0.7:compile
[DEBUG] Created new class realm plugin>org.apache.maven.plugins:maven-plugin-plugin:3.13.1
[DEBUG] Importing foreign packages into class realm plugin>org.apache.maven.plugins:maven-plugin-plugin:3.13.1
[DEBUG] Imported: < maven.api
[DEBUG] Populating class realm plugin>org.apache.maven.plugins:maven-plugin-plugin:3.13.1
[DEBUG] Included: org.apache.maven.plugins:maven-plugin-plugin:jar:3.13.1
[DEBUG] Included: org.apache.maven.plugin-tools:maven-plugin-tools-api:jar:3.13.1
[DEBUG] Included: org.codehaus.plexus:plexus-sec-dispatcher:jar:2.0
[DEBUG] Included: org.codehaus.plexus:plexus-cipher:jar:2.0
[DEBUG] Included: org.apache.maven:maven-builder-support:jar:3.9.6
[DEBUG] Included: org.apache.maven.resolver:maven-resolver-named-locks:jar:1.9.18
[DEBUG] Included: org.apache.maven.shared:maven-shared-utils:jar:3.3.4
[DEBUG] Included: org.eclipse.sisu:org.eclipse.sisu.inject:jar:0.9.0.M2
[DEBUG] Included: com.google.inject:guice:jar:5.1.0
[DEBUG] Included: aopalliance:aopalliance:jar:1.0
[DEBUG] Included: com.google.guava:guava:jar:32.0.1-jre
[DEBUG] Included: com.google.guava:failureaccess:jar:1.0.1
[DEBUG] Included: org.codehaus.plexus:plexus-interpolation:jar:1.26
[DEBUG] Included: org.codehaus.plexus:plexus-component-annotations:jar:2.1.0
[DEBUG] Included: org.apache.commons:commons-lang3:jar:3.12.0
[DEBUG] Included: org.apache.maven.reporting:maven-reporting-api:jar:3.1.1
[DEBUG] Included: org.apache.maven.doxia:doxia-sink-api:jar:1.11.1
[DEBUG] Included: org.apache.maven.doxia:doxia-logging-api:jar:1.11.1
[DEBUG] Included: javax.enterprise:cdi-api:jar:1.2
[DEBUG] Included: org.codehaus.plexus:plexus-xml:jar:3.0.1
[DEBUG] Included: org.apache.httpcomponents:httpclient:jar:4.5.14
[DEBUG] Included: commons-logging:commons-logging:jar:1.2
[DEBUG] Included: commons-codec:commons-codec:jar:1.11
[DEBUG] Included: org.apache.httpcomponents:httpcore:jar:4.4.16
[DEBUG] Included: org.codehaus.plexus:plexus-java:jar:1.2.0
[DEBUG] Included: org.apache.maven.plugin-tools:maven-plugin-tools-generators:jar:3.13.1
[DEBUG] Included: org.apache.velocity:velocity:jar:1.7
[DEBUG] Included: commons-lang:commons-lang:jar:2.4
[DEBUG] Included: org.jsoup:jsoup:jar:1.17.2
[DEBUG] Included: net.sf.jtidy:jtidy:jar:r938
[DEBUG] Included: org.apache.maven.plugin-tools:maven-plugin-tools-java:jar:3.13.1
[DEBUG] Included: com.thoughtworks.qdox:qdox:jar:2.1.0
[DEBUG] Included: org.apache.maven.plugin-tools:maven-plugin-tools-annotations:jar:3.13.1
[DEBUG] Included: org.codehaus.plexus:plexus-archiver:jar:4.9.2
[DEBUG] Included: org.codehaus.plexus:plexus-io:jar:3.4.2
[DEBUG] Included: commons-io:commons-io:jar:2.15.1
[DEBUG] Included: org.apache.commons:commons-compress:jar:1.26.1
[DEBUG] Included: org.iq80.snappy:snappy:jar:0.4
[DEBUG] Included: org.tukaani:xz:jar:1.9
[DEBUG] Included: com.github.luben:zstd-jni:jar:1.5.5-11
[DEBUG] Included: org.ow2.asm:asm:jar:9.7
[DEBUG] Included: org.ow2.asm:asm-util:jar:9.7
[DEBUG] Included: org.ow2.asm:asm-tree:jar:9.7
[DEBUG] Included: org.ow2.asm:asm-analysis:jar:9.7
[DEBUG] Included: org.apache.maven.plugin-tools:maven-plugin-annotations:jar:3.13.1
[DEBUG] Included: org.apache.maven.plugin-tools:maven-plugin-tools-ant:jar:3.13.1
[DEBUG] Included: org.apache.maven.plugin-tools:maven-plugin-tools-model:jar:3.13.1
[DEBUG] Included: org.apache.maven.plugin-tools:maven-plugin-tools-beanshell:jar:3.13.1
[DEBUG] Included: org.apache-extras.beanshell:bsh:jar:2.0b6
[DEBUG] Included: org.codehaus.plexus:plexus-utils:jar:4.0.1
[DEBUG] Included: org.codehaus.plexus:plexus-velocity:jar:1.2
[DEBUG] Included: commons-collections:commons-collections:jar:3.1
[DEBUG] Included: org.sonatype.plexus:plexus-build-api:jar:0.0.7
[DEBUG] Loading mojo org.apache.maven.plugins:maven-plugin-plugin:3.13.1:helpmojo from plugin realm ClassRealm[plugin>org.apache.maven.plugins:maven-plugin-plugin:3.13.1, parent: jdk.internal.loader.ClassLoaders$AppClassLoader@76ed5528]
[DEBUG] Setting property: velocimacro.permissions.allow.inline.to.replace.global => 'true'.
[DEBUG] Setting property: eventhandler.include.class => 'org.apache.velocity.app.event.implement.IncludeRelativePath'.
[DEBUG] Setting property: velocimacro.messages.on => 'false'.
[DEBUG] Setting property: file.resource.loader.path => ''.
[DEBUG] Setting property: resource.loader => 'classpath,file'.
[DEBUG] Setting property: file.resource.loader.class => 'org.apache.velocity.runtime.resource.loader.FileResourceLoader'.
[DEBUG] Setting property: runtime.log.invalid.references => 'false'.
[DEBUG] Setting property: resource.manager.logwhenfound => 'false'.
[DEBUG] Setting property: classpath.resource.loader.class => 'org.apache.velocity.runtime.resource.loader.ClasspathResourceLoader'.
[DEBUG] Initializing Velocity, Calling init()...
[DEBUG] *******************************************************************
[DEBUG] Starting Apache Velocity v1.7 (compiled: 2010-11-19 12:14:37)
[DEBUG] RuntimeInstance initializing.
[DEBUG] Default Properties File: org\apache\velocity\runtime\defaults\velocity.properties
[DEBUG] Default ResourceManager initializing. (class org.apache.velocity.runtime.resource.ResourceManagerImpl)
[DEBUG] ResourceLoader instantiated: org.apache.velocity.runtime.resource.loader.ClasspathResourceLoader
[DEBUG] ClasspathResourceLoader : initialization complete.
[DEBUG] ResourceLoader instantiated: org.apache.velocity.runtime.resource.loader.FileResourceLoader
[DEBUG] FileResourceLoader : initialization starting.
[DEBUG] Do unicode file recognition: false
[DEBUG] FileResourceLoader : adding path ''
[DEBUG] FileResourceLoader : initialization complete.
[DEBUG] ResourceCache: initialized (class org.apache.velocity.runtime.resource.ResourceCacheImpl) with class java.util.Collections$SynchronizedMap cache map.
[DEBUG] Default ResourceManager initialization complete.
[DEBUG] Loaded System Directive: org.apache.velocity.runtime.directive.Stop
[DEBUG] Loaded System Directive: org.apache.velocity.runtime.directive.Define
[DEBUG] Loaded System Directive: org.apache.velocity.runtime.directive.Break
[DEBUG] Loaded System Directive: org.apache.velocity.runtime.directive.Evaluate
[DEBUG] Loaded System Directive: org.apache.velocity.runtime.directive.Literal
[DEBUG] Loaded System Directive: org.apache.velocity.runtime.directive.Macro
[DEBUG] Loaded System Directive: org.apache.velocity.runtime.directive.Parse
[DEBUG] Loaded System Directive: org.apache.velocity.runtime.directive.Include
[DEBUG] Loaded System Directive: org.apache.velocity.runtime.directive.Foreach
[DEBUG] Created '20' parsers.
[DEBUG] Velocimacro : initialization starting.
[DEBUG] Velocimacro : allowInline = true : VMs can be defined inline in templates
[DEBUG] Velocimacro : allowInlineToOverride = true : VMs defined inline may replace previous VM definitions
[DEBUG] Velocimacro : allowInlineLocal = false : VMs defined inline will be global in scope if allowed.
[DEBUG] Velocimacro : autoload off : VM system will not automatically reload global library macros
[DEBUG] Velocimacro : Velocimacro : initialization complete.
[DEBUG] RuntimeInstance successfully initialized.
[DEBUG] Configuring mojo execution 'org.apache.maven.plugins:maven-plugin-plugin:3.13.1:helpmojo:help-goal' with basic configurator -->
[DEBUG] (f) outputDirectory = C:\Users\Ale\Documents\java projects\maven-plugin-test2\target\generated-sources\plugin
[DEBUG] (f) skip = false
[DEBUG] -- end configuration --
[INFO] ------------------------------------------------------------------------
[INFO] BUILD FAILURE
[INFO] ------------------------------------------------------------------------
[INFO] Total time: 2.351 s
[INFO] Finished at: 2025-05-24T00:35:50+02:00
[INFO] ------------------------------------------------------------------------
[ERROR] Failed to execute goal org.apache.maven.plugins:maven-plugin-plugin:3.13.1:helpmojo (help-goal) on project maven-plugin-test: You need to specify a goalPrefix as it can not be correctly computed -> [Help 1]
org.apache.maven.lifecycle.LifecycleExecutionException: Failed to execute goal org.apache.maven.plugins:maven-plugin-plugin:3.13.1:helpmojo (help-goal) on project maven-plugin-test: You need to specify a goalPrefix as it can not be correctly computed
at org.apache.maven.lifecycle.internal.MojoExecutor.doExecute2 (MojoExecutor.java:333)
at org.apache.maven.lifecycle.internal.MojoExecutor.doExecute (MojoExecutor.java:316)
at org.apache.maven.lifecycle.internal.MojoExecutor.execute (MojoExecutor.java:212)
at org.apache.maven.lifecycle.internal.MojoExecutor.execute (MojoExecutor.java:174)
at org.apache.maven.lifecycle.internal.MojoExecutor.access$000 (MojoExecutor.java:75)
at org.apache.maven.lifecycle.internal.MojoExecutor$1.run (MojoExecutor.java:162)
at org.apache.maven.plugin.DefaultMojosExecutionStrategy.execute (DefaultMojosExecutionStrategy.java:39)
at org.apache.maven.lifecycle.internal.MojoExecutor.execute (MojoExecutor.java:159)
at org.apache.maven.lifecycle.internal.LifecycleModuleBuilder.buildProject (LifecycleModuleBuilder.java:105)
at org.apache.maven.lifecycle.internal.LifecycleModuleBuilder.buildProject (LifecycleModuleBuilder.java:73)
at org.apache.maven.lifecycle.internal.builder.singlethreaded.SingleThreadedBuilder.build (SingleThreadedBuilder.java:53)
at org.apache.maven.lifecycle.internal.LifecycleStarter.execute (LifecycleStarter.java:118)
at org.apache.maven.DefaultMaven.doExecute (DefaultMaven.java:261)
at org.apache.maven.DefaultMaven.doExecute (DefaultMaven.java:173)
at org.apache.maven.DefaultMaven.execute (DefaultMaven.java:101)
at org.apache.maven.cli.MavenCli.execute (MavenCli.java:906)
at org.apache.maven.cli.MavenCli.doMain (MavenCli.java:283)
at org.apache.maven.cli.MavenCli.main (MavenCli.java:206)
at jdk.internal.reflect.DirectMethodHandleAccessor.invoke (DirectMethodHandleAccessor.java:103)
at java.lang.reflect.Method.invoke (Method.java:580)
at org.codehaus.plexus.classworlds.launcher.Launcher.launchEnhanced (Launcher.java:255)
at org.codehaus.plexus.classworlds.launcher.Launcher.launch (Launcher.java:201)
at org.codehaus.plexus.classworlds.launcher.Launcher.mainWithExitCode (Launcher.java:361)
at org.codehaus.plexus.classworlds.launcher.Launcher.main (Launcher.java:314)
at org.codehaus.classworlds.Launcher.main (Launcher.java:41)
Caused by: org.apache.maven.plugin.MojoExecutionException: You need to specify a goalPrefix as it can not be correctly computed
at org.apache.maven.plugin.plugin.AbstractGeneratorMojo.execute (AbstractGeneratorMojo.java:88)
at org.apache.maven.plugin.DefaultBuildPluginManager.executeMojo (DefaultBuildPluginManager.java:126)
at org.apache.maven.lifecycle.internal.MojoExecutor.doExecute2 (MojoExecutor.java:328)
at org.apache.maven.lifecycle.internal.MojoExecutor.doExecute (MojoExecutor.java:316)
at org.apache.maven.lifecycle.internal.MojoExecutor.execute (MojoExecutor.java:212)
at org.apache.maven.lifecycle.internal.MojoExecutor.execute (MojoExecutor.java:174)
at org.apache.maven.lifecycle.internal.MojoExecutor.access$000 (MojoExecutor.java:75)
at org.apache.maven.lifecycle.internal.MojoExecutor$1.run (MojoExecutor.java:162)
at org.apache.maven.plugin.DefaultMojosExecutionStrategy.execute (DefaultMojosExecutionStrategy.java:39)
at org.apache.maven.lifecycle.internal.MojoExecutor.execute (MojoExecutor.java:159)
at org.apache.maven.lifecycle.internal.LifecycleModuleBuilder.buildProject (LifecycleModuleBuilder.java:105)
at org.apache.maven.lifecycle.internal.LifecycleModuleBuilder.buildProject (LifecycleModuleBuilder.java:73)
at org.apache.maven.lifecycle.internal.builder.singlethreaded.SingleThreadedBuilder.build (SingleThreadedBuilder.java:53)
at org.apache.maven.lifecycle.internal.LifecycleStarter.execute (LifecycleStarter.java:118)
at org.apache.maven.DefaultMaven.doExecute (DefaultMaven.java:261)
at org.apache.maven.DefaultMaven.doExecute (DefaultMaven.java:173)
at org.apache.maven.DefaultMaven.execute (DefaultMaven.java:101)
at org.apache.maven.cli.MavenCli.execute (MavenCli.java:906)
at org.apache.maven.cli.MavenCli.doMain (MavenCli.java:283)
at org.apache.maven.cli.MavenCli.main (MavenCli.java:206)
at jdk.internal.reflect.DirectMethodHandleAccessor.invoke (DirectMethodHandleAccessor.java:103)
at java.lang.reflect.Method.invoke (Method.java:580)
at org.codehaus.plexus.classworlds.launcher.Launcher.launchEnhanced (Launcher.java:255)
at org.codehaus.plexus.classworlds.launcher.Launcher.launch (Launcher.java:201)
at org.codehaus.plexus.classworlds.launcher.Launcher.mainWithExitCode (Launcher.java:361)
at org.codehaus.plexus.classworlds.launcher.Launcher.main (Launcher.java:314)
at org.codehaus.classworlds.Launcher.main (Launcher.java:41)
[ERROR]
[ERROR]
[ERROR] For more information about the errors and possible solutions, please read the following articles:
[ERROR] [Help 1] http://cwiki.apache.org/confluence/display/MAVEN/MojoExecutionException
[DEBUG] Shutting down adapter factory; available factories [file-lock, rwlock-local, semaphore-local, noop]; available name mappers [discriminating, file-gav, file-hgav, file-static, gav, static]
[DEBUG] Shutting down 'file-lock' factory
[DEBUG] Shutting down 'rwlock-local' factory
[DEBUG] Shutting down 'semaphore-local' factory
[DEBUG] Shutting down 'noop' factory
Process finished with exit code 1